FailedConsole Output

[FSTrigger] Triggered by a change to a folder (log)
Building in workspace /var/lib/jenkins/jobs/seafile_ynh (josue)/workspace
[workspace] $ /bin/sh -xe /tmp/jenkins1180939382302556974.sh
+ /home/CI_package_check/analyseCI.sh /home/yunohost.app/ssh_chroot_directories/josue/data/seafile_ynh seafile_ynh (josue)

Tue Jul 30 20:49:03 UTC 2019
Wait for work starting...
............
Tue Jul 30 20:55:03 UTC 2019
Package check currently test the package
Start a test
Loads functions from launcher.sh
Loads functions from testing_process.sh
Loads functions from log_extractor.sh
Restore the previous snapshot.
Working time: 16 seconds.
Disable iptables rules.
Disable the network bridge.
Pick up the package which will be tested.
Initialize network for LXC.
RTNETLINK answers: File exists
ifup: failed to bring up lxc-pchecker
Activate iptables rules.
Parsing of check_process file

Tests serie: Nom du test

>> YunoHost versions:
Start the LXC container.
Create witness files...
Working time: 6 seconds.
Working time: 5 seconds.
Debian GNU/Linux 9
yunohost: 
  repo: stable
  version: 3.6.4.3
yunohost-admin: 
  repo: stable
  version: 3.6.4
moulinette: 
  repo: stable
  version: 3.6.4
ssowat: 
  repo: stable
  version: 3.6.4
Connection to 10.1.4.2 closed.


>> Package linter... [Test 1/13]

    [YunoHost App Package Linter]

 App packaging documentation - https://yunohost.org/#/packaging_apps
 App package example         - https://github.com/YunoHost/example_ynh
 Official helpers            - https://yunohost.org/#/packaging_apps_helpers_en
 Experimental helpers        - https://github.com/YunoHost-Apps/Experimental_helpers

    Analyzing package /home/CI_package_check/dev_CI/../package_check/seafile_ynh_check

 [Loading App]


 [Misc File Checks]


 [Sources Management]


 [Manifest]

! [YEP-2.1] You should specify the type of the argument 'server_name'. You can use : domain, path, boolean, app, password, user, string. 

 [Install Script]

? [YEP-2.4] 'ynh_die' or 'exit' command is executed with system modification before (cmd 'rm').
This system modification is an issue if a verification exit the script.
You should move this verification before any system modification. 

 [Remove Script]


 [Upgrade Script]


 [Backup Script]


 [Restore Script]

? [YEP-2.4] 'ynh_die' or 'exit' command is executed with system modification before (cmd 'rm').
This system modification is an issue if a verification exit the script.
You should move this verification before any system modification. 
--- SUCCESS ---


>> Installation in a sub path... [Test 2/13]
A LXC container is already running.
Working time: 2 seconds.
Working time: 1 minute, 44 seconds.
Installation failed. (1)
Info: yunohost.app app_install - [986.1] Installing application seafile…
Info:  [....................] > Validating installation parameters...
Info:  [....................] > Finding available ports...
Info:  [+...................] > Storing installation settings...
Info:  [#...................] > Configuring system user...
Info:  [#+++................] > Installing dependencies...
Warning: yunohost.hook <lambda> - [986.1] 
Extracting templates from packages: 19%
Extracting templates from packages: 39%
Extracting templates from packages: 59%
Extracting templates from packages: 78%
Extracting templates from packages: 98%
Extracting templates from packages: 100%
Info:  [####+...............] > Cleaning data directory...
Info:  [#####...............] > Creating base directory...
Info:  [#####+++............] > Installing sources files...
Warning: yunohost.hook <lambda> - [986.1] Unable to apply patches
Warning: yunohost.hook <lambda> - [986.1] [ERR] !!
Warning: yunohost.hook <lambda> - [986.1]   seafile's script has encountered an error. Its execution was cancelled.
Warning: yunohost.hook <lambda> - [986.1] !!
Warning: yunohost.hook <lambda> - [986.1] Please find here an extract of the log before the crash:
Warning: yunohost.hook <lambda> - [986.1] [DEBUG]: DEBUG   - + cd /opt/yunohost/seafile/seafile-server-7.0.4
Warning: yunohost.hook <lambda> - [986.1] [DEBUG]: DEBUG   - + for p in $YNH_CWD/../sources/patches/${source_id}-*.patch
Warning: yunohost.hook <lambda> - [986.1] [DEBUG]: DEBUG   - + patch -p1
Warning: yunohost.hook <lambda> - [986.1] [DEBUG]: DEBUG   - patching file seahub/seahub/auth/middleware.py
Warning: - Unable to apply patches
Warning: yunohost.hook <lambda> - [986.1] [DEBUG]: DEBUG   - Hunk #1 FAILED at 1.
Warning: yunohost.hook <lambda> - [986.1] [DEBUG]: DEBUG   - Hunk #2 succeeded at 85 with fuzz 2 (offset 35 lines).
Warning: yunohost.hook <lambda> - [986.1] [DEBUG]: DEBUG   - 1 out of 2 hunks FAILED -- saving rejects to file seahub/seahub/auth/middleware.py.rej
Warning: yunohost.hook <lambda> - [986.1] [DEBUG]: DEBUG   - patching file seahub/seahub/base/accounts.py
Warning: yunohost.hook <lambda> - [986.1] [DEBUG]: DEBUG   - Hunk #1 succeeded at 583 (offset 187 lines).
Warning: yunohost.hook <lambda> - [986.1] [DEBUG]: DEBUG   - patching file seahub/seahub/settings.py
Warning: yunohost.hook <lambda> - [986.1] [DEBUG]: DEBUG   - Hunk #1 succeeded at 118 (offset 4 lines).
Warning: yunohost.hook <lambda> - [986.1] [DEBUG]: DEBUG   - Hunk #2 FAILED at 233.
Warning: yunohost.hook <lambda> - [986.1] [DEBUG]: DEBUG   - 1 out of 2 hunks FAILED -- saving rejects to file seahub/seahub/settings.py.rej
Warning: yunohost.hook <lambda> - [986.1] [DEBUG]: DEBUG   - + ynh_die '--message=Unable to apply patches'
Warning: yunohost.hook <lambda> - [986.1] [DEBUG]: DEBUG   - + local legacy_args=mc
Warning: yunohost.hook <lambda> - [986.1] [DEBUG]: DEBUG   -=ret_code=)
Warning: yunohost.hook <lambda> - [986.1] [DEBUG]: DEBUG   - + declare -Ar args_array
Warning: yunohost.hook <lambda> - [986.1] [DEBUG]: DEBUG   - + local message
Warning: yunohost.hook <lambda> - [986.1] [DEBUG]: DEBUG   - + local ret_code
Warning: yunohost.hook <lambda> - [986.1] [DEBUG]: DEBUG   - + ynh_handle_getopts_args '--message=Unable to apply patches'
Warning: yunohost.hook <lambda> - [986.1] [DEBUG]: DEBUG   - + set +x
Warning: yunohost.hook <lambda> - [986.1] [DEBUG]: DEBUG   - + echo 'Unable to apply patches'
Warning: yunohost.hook <lambda> - [986.1] [DEBUG]: DEBUG   - + exit 1
Warning: yunohost.hook <lambda> - [986.1] [DEBUG]: DEBUG   - + ynh_exit_properly
Info: yunohost.log close - [986.1] The operation 'Install 'seafile' application' has failed! To get help, please share the full log of this operation using the command 'yunohost log display 20190730-205551-app_install-seafile --share'
Info:  [....................] > Loading installation settings...
Warning: yunohost.hook <lambda> - [986.1] Failed to stop seafile.service: Unit seafile.service not loaded.
Info:  [+...................] > Stoping services...
Warning: yunohost.hook <lambda> - [986.1] -- No entries --
Warning: yunohost.hook <lambda> - [986.1] Failed to stop seahub.service: Unit seahub.service not loaded.
Warning: yunohost.hook <lambda> - [986.1] -- No entries --
Warning: yunohost.hook <lambda> - [986.1] Traceback (most recent call last):
Info:  [#+..................] > Cleaning SSO configuration...
Warning: yunohost.hook <lambda> - [986.1]   File "../conf/remove_sso_conf.py", line 5, in <module>
Warning: yunohost.hook <lambda> - [986.1]     data["skipped_urls"].remove("/seafhttp")
Warning: yunohost.hook <lambda> - [986.1] KeyError: 'skipped_urls'
Info:  [##..................] > Removing logs...
Info:  /var/log/seafile wasn't deleted because it doesn't exist.
Info:  [##+.................] > Removing code...
Info:  /var/www/seafile wasn't deleted because it doesn't exist.
Info:  [###+++++++..........] > Backing up user data...
Warning: yunohost.hook <lambda> - [986.1] [WARN] Database ccnetdb not found
Info:  /home/yunohost.app/seafile-data wasn't deleted because it doesn't exist.
Info:  /tmp/seahub_cache wasn't deleted because it doesn't exist.
Info:  [##########..........] > Removing databases...
Warning: yunohost.hook <lambda> - [986.1] [WARN] Database seafiledb not found
Warning: yunohost.hook <lambda> - [986.1] [WARN] Database seahubdb not found
Info:  [##########+.........] > Removing systemd units...
Info:  [###########+........] > Removing the dedicated system user...
Info:  [############++++++..] > Removing dependencies
Info:  [##################+.] > Removing configuration...
Info:  /etc/nginx/conf.d/sous.domain.tld.d/seafile.conf wasn't deleted because it doesn't exist.
Info:  /etc/fail2ban/jail.d/seafile.conf wasn't deleted because it doesn't exist.
Info:  /etc/fail2ban/filter.d/seafile.conf wasn't deleted because it doesn't exist.
Error: yunohost cli - Unknown service 'seafile'
Warning: yunohost.hook <lambda> - [986.1] Unknown service 'seafile'
Error: yunohost cli - Unknown service 'seahub'
Warning: yunohost.hook <lambda> - [986.1] Unknown service 'seahub'
Info:  [####################] > Removal of seafile completed
Error: yunohost cli - The operation 'Install 'seafile' application' has failed! To get help, please share the full log of this operation using the command 'yunohost log display 20190730-205551-app_install-seafile --share'

Try to access by url...
Test url: sous.domain.tld/path
Real url: https://domain.tld/yunohost/sso/?r=aHR0cHM6Ly9zb3VzLmRvbWFpbi50bGQvcGF0aA==
HTTP code: 200
Title of the page: YunoHost Portal
The connection attempt fall on the YunoHost portal.
Test url: sous.domain.tld/path/
Real url: https://domain.tld/yunohost/sso/?r=aHR0cHM6Ly9zb3VzLmRvbWFpbi50bGQvcGF0aC8=
HTTP code: 200
Title of the page: YunoHost Portal
The connection attempt fall on the YunoHost portal.
--- FAIL ---

Deleting...
A LXC container is already running.
Working time: 1 second.
Working time: 3 seconds.
Deleting failed. (1)
Error: yunohost cli - seafile is not installed
--- FAIL ---
Stop the LXC container
Restore the previous snapshot.
Working time: 26 seconds.
Working time for this test: 2 minutes, 21 seconds.


>> Installation on the root... [Test 3/13]
Start the LXC container..
Create witness files...
Working time: 10 seconds.
Working time: 1 minute, 46 seconds.
Installation failed. (1)
Info: yunohost.app app_install - [917.1] Installing application seafile…
Info:  [....................] > Validating installation parameters...
Info:  [....................] > Finding available ports...
Info:  [+...................] > Storing installation settings...
Info:  [#...................] > Configuring system user...
Info:  [#+++................] > Installing dependencies...
Warning: yunohost.hook <lambda> - [917.1] 
Extracting templates from packages: 19%
Extracting templates from packages: 39%
Extracting templates from packages: 59%
Extracting templates from packages: 78%
Extracting templates from packages: 98%
Extracting templates from packages: 100%
Info:  [####+...............] > Cleaning data directory...
Info:  [#####...............] > Creating base directory...
Info:  [#####+++............] > Installing sources files...
Warning: yunohost.hook <lambda> - [917.1] Unable to apply patches
Warning: yunohost.hook <lambda> - [917.1] [ERR] !!
Warning: yunohost.hook <lambda> - [917.1]   seafile's script has encountered an error. Its execution was cancelled.
Warning: yunohost.hook <lambda> - [917.1] !!
Warning: yunohost.hook <lambda> - [917.1] Please find here an extract of the log before the crash:
Warning: yunohost.hook <lambda> - [917.1] [DEBUG]: DEBUG   - + local old_dir=/var/cache/yunohost/from_file/scripts
Warning: yunohost.hook <lambda> - [917.1] [DEBUG]: DEBUG   - + cd /opt/yunohost/seafile/seafile-server-7.0.4
Warning: yunohost.hook <lambda> - [917.1] [DEBUG]: DEBUG   - + for p in $YNH_CWD/../sources/patches/${source_id}-*.patch
Warning: yunohost.hook <lambda> - [917.1] [DEBUG]: DEBUG   - + patch -p1
Warning: yunohost.hook <lambda> - [917.1] [DEBUG]: DEBUG   - patching file seahub/seahub/auth/middleware.py
Warning: yunohost.hook <lambda> - [917.1] [DEBUG]: DEBUG   - Hunk #1 FAILED at 1.
Warning: yunohost.hook <lambda> - [917.1] [DEBUG]: DEBUG   - Hunk #2 succeeded at 85 with fuzz 2 (offset 35 lines).
Warning: yunohost.hook <lambda> - [917.1] [DEBUG]: DEBUG   - 1 out of 2 hunks FAILED -- saving rejects to file seahub/seahub/auth/middleware.py.rej
Warning: yunohost.hook <lambda> - [917.1] [DEBUG]: DEBUG   - patching file seahub/seahub/base/accounts.py
Warning: yunohost.hook <lambda> - [917.1] [DEBUG]: DEBUG   - Hunk #1 succeeded at 583 (offset 187 lines).
Warning: yunohost.hook <lambda> - [917.1] [DEBUG]: DEBUG   - patching file seahub/seahub/settings.py
Warning: yunohost.hook <lambda> - [917.1] [DEBUG]: DEBUG   - Hunk #1 succeeded at 118 (offset 4 lines).
Warning: yunohost.hook <lambda> - [917.1] [DEBUG]: DEBUG   - Hunk #2 FAILED at 233.
Warning: yunohost.hook <lambda> - [917.1] [DEBUG]: DEBUG   - 1 out of 2 hunks FAILED -- saving rejects to file seahub/seahub/settings.py.rej
Warning: yunohost.hook <lambda> - [917.1] [DEBUG]: DEBUG   - + ynh_die '--message=Unable to apply patches'
Warning: yunohost.hook <lambda> - [917.1] [DEBUG]: DEBUG   - + local legacy_args=mc
Warning: yunohost.hook <lambda> - [917.1] [DEBUG]: DEBUG   -=ret_code=)
Warning: yunohost.hook <lambda> - [917.1] [DEBUG]: DEBUG   - + declare -Ar args_array
Warning: yunohost.hook <lambda> - [917.1] [DEBUG]: DEBUG   - + local message
Warning: yunohost.hook <lambda> - [917.1] [DEBUG]: DEBUG   - + local ret_code
Warning: yunohost.hook <lambda> - [917.1] [DEBUG]: DEBUG   - + ynh_handle_getopts_args '--message=Unable to apply patches'
Warning: yunohost.hook <lambda> - [917.1] [DEBUG]: DEBUG   - + set +x
Warning: yunohost.hook <lambda> - [917.1] [DEBUG]: DEBUG   - + echo 'Unable to apply patches'
Warning: yunohost.hook <lambda> - [917.1] [DEBUG]: DEBUG   - + exit 1
Warning: yunohost.hook <lambda> - [917.1] [DEBUG]: DEBUG   - + ynh_exit_properly
Info: yunohost.log close - [917.1] The operation 'Install 'seafile' application' has failed! To get help, please share the full log of this operation using the command 'yunohost log display 20190730-205822-app_install-seafile --share'
Info:  [....................] > Loading installation settings...
Info:  [+...................] > Stoping services...
Warning: yunohost.hook <lambda> - [917.1] Failed to stop seafile.service: Unit seafile.service not loaded.
Warning: yunohost.hook <lambda> - [917.1] -- No entries --
Warning: yunohost.hook <lambda> - [917.1] Failed to stop seahub.service: Unit seahub.service not loaded.
Warning: yunohost.hook <lambda> - [917.1] -- No entries --
Warning: yunohost.hook <lambda> - [917.1] Traceback (most recent call last):
Warning: yunohost.hook <lambda> - [917.1]   File "../conf/remove_sso_conf.py", line 5, in <module>
Warning: yunohost.hook <lambda> - [917.1]     data["skipped_urls"].remove("/seafhttp")
Warning: yunohost.hook <lambda> - [917.1] KeyError: 'skipped_urls'
Info:  [#+..................] > Cleaning SSO configuration...
Info:  [##..................] > Removing logs...
Info:  /var/log/seafile wasn't deleted because it doesn't exist.
Info:  [##+.................] > Removing code...
Info:  /var/www/seafile wasn't deleted because it doesn't exist.
Info:  [###+++++++..........] > Backing up user data...
Info:  /home/yunohost.app/seafile-data wasn't deleted because it doesn't exist.
Info:  /tmp/seahub_cache wasn't deleted because it doesn't exist.
Info:  [##########..........] > Removing databases...
Warning: yunohost.hook <lambda> - [917.1] [WARN] Database ccnetdb not found
Warning: yunohost.hook <lambda> - [917.1] [WARN] Database seafiledb not found
Warning: yunohost.hook <lambda> - [917.1] [WARN] Database seahubdb not found
Info:  [##########+.........] > Removing systemd units...
Info:  [###########+........] > Removing the dedicated system user...
Info:  [############++++++..] > Removing dependencies
Info:  [##################+.] > Removing configuration...
Info:  /etc/nginx/conf.d/sous.domain.tld.d/seafile.conf wasn't deleted because it doesn't exist.
Info:  /etc/fail2ban/jail.d/seafile.conf wasn't deleted because it doesn't exist.
Info:  /etc/fail2ban/filter.d/seafile.conf wasn't deleted because it doesn't exist.
Error: yunohost cli - Unknown service 'seafile'
Warning: yunohost.hook <lambda> - [917.1] Unknown service 'seafile'
Error: yunohost cli - Unknown service 'seahub'
Warning: yunohost.hook <lambda> - [917.1] Unknown service 'seahub'
Error: yunohost cli - The operation 'Install 'seafile' application' has failed! To get help, please share the full log of this operation using the command 'yunohost log display 20190730-205822-app_install-seafile --share'

Try to access by url...
Test url: sous.domain.tld
Real url: https://domain.tld/yunohost/sso/?r=aHR0cHM6Ly9zb3VzLmRvbWFpbi50bGQv
HTTP code: 200
Title of the page: YunoHost Portal
The connection attempt fall on the YunoHost portal.
Test url: sous.domain.tld/
Real url: https://domain.tld/yunohost/sso/?r=aHR0cHM6Ly9zb3VzLmRvbWFpbi50bGQv
HTTP code: 200
Title of the page: YunoHost Portal
The connection attempt fall on the YunoHost portal.
--- FAIL ---

Deleting...
A LXC container is already running.
Working time: 1 second.
Working time: 3 seconds.
Deleting failed. (1)
Error: yunohost cli - seafile is not installed
--- FAIL ---
Stop the LXC container
Restore the previous snapshot.
Working time: 27 seconds.
Working time for this test: 2 minutes, 31 seconds.


>> Upgrade from the same version... [Test 4/13]
All installs have failed, impossible to perform this test...
Restore the previous snapshot.
Working time: 17 seconds.
Working time for this test: 17 seconds.


>> Installation in private mode... [Test 5/13]
All installs have failed, impossible to perform this test...
Restore the previous snapshot.
Working time: 18 seconds.
Working time for this test: 18 seconds.


>> Installation in public mode... [Test 6/13]
All installs have failed, impossible to perform this test...
Restore the previous snapshot.
Working time: 17 seconds.
Working time for this test: 17 seconds.


>> Malformed path... [Test 7/13]
All installs have failed, impossible to perform this test...
Restore the previous snapshot.
Working time: 16 seconds.
Working time for this test: 17 seconds.


>> Port already used... [Test 8/13]
All installs have failed, impossible to perform this test...
Restore the previous snapshot.
Working time: 18 seconds.
Working time for this test: 18 seconds.


>> Backup/Restore... [Test 9/13]
All installs have failed, impossible to perform this test...
Restore the previous snapshot.
Working time: 17 seconds.
Working time for this test: 17 seconds.


>> Change URL... [Test 10/13]
All installs have failed, impossible to perform this test...
Restore the previous snapshot.
Working time: 18 seconds.
Working time for this test: 18 seconds.



Package linter:                  SUCCESS
Installation:                    FAIL
Deleting:                        FAIL
Installation in a sub path:      FAIL
Deleting from a sub path:        FAIL
Installation on the root:        FAIL
Deleting from root:              FAIL
Upgrade:                         Not evaluated.
Installation in private mode:    Not evaluated.
Installation in public mode:     Not evaluated.
Multi-instance installations:    Not evaluated.
Malformed path:                  Not evaluated.
Port already used:               Not evaluated.
Backup:                          Not evaluated.
Restore:                         Not evaluated.
Change URL:                      Not evaluated.
Level of this application: 0 (Broken)
	   Level 1: 0
	   Level 2: 0
	   Level 3: 0
	   Level 4: 0
	   Level 5: 1
	   Level 6: 1
	   Level 7: 0
	   Level 8: 0
	   Level 9: 0
	   Level 10: 0
You can find the complete log of these tests in /home/CI_package_check/dev_CI/../package_check/Complete.log
Global working time for all tests: 7 minutes, 18 seconds.
mail: Cannot parse address `josue@tille.ch
mail: maxime@max.privy.place' (while expanding `josue@tille.ch
mail: maxime@max.privy.place'): Malformed email address
Disable iptables rules.
Disable the network bridge.
The complete log for this application was duplicated and is accessible at /home/CI_package_check/dev_CI/../logs/_home_yunohost.app_ssh_chroot_directories_josue_data_seafile_ynh_complete.log

Tue Jul 30 21:03:04 UTC 2019
Test finished.
Build step 'Execute shell' marked build as failure
Finished: FAILURE